failed to compile libevent, see 'setup.log' for mo 财富值3

2020-12-23 16:07发布

Compiling & installing libevent ...

-----

  ^~~~

bufferevent_openssl.c:237:2: note: (near initialization for 'methods_bufferevent')

bufferevent_openssl.c:228:19: error: storage size of 'methods_bufferevent' isn't known

 static BIO_METHOD methods_bufferevent = {

                   ^~~~~~~~~~~~~~~~~~~

make[2]: *** [Makefile:793: bufferevent_openssl.lo] Error 1

make[2]: Leaving directory '/root/xunsearch-full-1.4.15/libevent-2.0.21-stable'

make[1]: *** [Makefile:857: install-recursive] Error 1

make[1]: Leaving directory '/root/xunsearch-full-1.4.15/libevent-2.0.21-stable'

make: *** [Makefile:1182: install] Error 2

-----

ERROR: failed to compile libevent, see 'setup.log' for more detail

安装全文检索安装不了

付费偷看设置
发送
2条回答
mishen - whatsns产品经理
1楼 · 2020-12-24 09:56.采纳回答

要么自己付费找懂linux得人帮你安装好相关东西,要么自己换操作系统,常见都是ubutu乌班图操作系统和centos8+操作系统安装出问题

作者追问:2020-12-24 09:56

openssl版本问题 按照流程安装正常 还是跨站 

操作系统版本有关系